2024-05-27 07:43:11

by bluez.test.bot

[permalink] [raw]
Subject: RE: [v2] Bluetooth: 6lowpan: use DEV_STAT_INC() to avoid races

This is automated email and please do not reply to this email!

Dear submitter,

Thank you for submitting the patches to the linux bluetooth mailing list.
This is a CI test results with your patch series:
PW Link:https://patchwork.kernel.org/project/bluetooth/list/?series=856029

---Test result---

Test Summary:
CheckPatch PASS 1.48 seconds
GitLint PASS 0.28 seconds
SubjectPrefix PASS 0.09 seconds
BuildKernel PASS 30.17 seconds
CheckAllWarning PASS 33.30 seconds
CheckSparse PASS 38.45 seconds
CheckSmatch FAIL 38.05 seconds
BuildKernel32 PASS 28.90 seconds
TestRunnerSetup PASS 523.54 seconds
TestRunner_l2cap-tester PASS 20.42 seconds
TestRunner_iso-tester FAIL 32.55 seconds
TestRunner_bnep-tester PASS 4.88 seconds
TestRunner_mgmt-tester PASS 114.01 seconds
TestRunner_rfcomm-tester PASS 8.52 seconds
TestRunner_sco-tester PASS 15.01 seconds
TestRunner_ioctl-tester PASS 7.88 seconds
TestRunner_mesh-tester PASS 6.11 seconds
TestRunner_smp-tester PASS 6.94 seconds
TestRunner_userchan-tester PASS 5.07 seconds
IncrementalBuild PASS 27.55 seconds

Details
##############################
Test: CheckSmatch - FAIL
Desc: Run smatch tool with source
Output:

Segmentation fault (core dumped)
make[4]: *** [scripts/Makefile.build:244: net/bluetooth/hci_core.o] Error 139
make[4]: *** Deleting file 'net/bluetooth/hci_core.o'
make[3]: *** [scripts/Makefile.build:485: net/bluetooth] Error 2
make[2]: *** [scripts/Makefile.build:485: net] Error 2
make[2]: *** Waiting for unfinished jobs....
Segmentation fault (core dumped)
make[4]: *** [scripts/Makefile.build:244: drivers/bluetooth/bcm203x.o] Error 139
make[4]: *** Deleting file 'drivers/bluetooth/bcm203x.o'
make[4]: *** Waiting for unfinished jobs....
make[3]: *** [scripts/Makefile.build:485: drivers/bluetooth] Error 2
make[2]: *** [scripts/Makefile.build:485: drivers] Error 2
make[1]: *** [/github/workspace/src/src/Makefile:1919: .] Error 2
make: *** [Makefile:240: __sub-make] Error 2
##############################
Test: TestRunner_iso-tester - FAIL
Desc: Run iso-tester with test-runner
Output:
Total: 122, Passed: 117 (95.9%), Failed: 1, Not Run: 4

Failed Test Cases
ISO Connect Suspend - Success Failed 4.178 seconds


---
Regards,
Linux Bluetooth